{"text_format":"3","workbook":"xlsx","n_sheets":2,"sheets":["Sheet1","Sheet2"],"not_rendered":{"external_links":1,"defined_names":1},"read":"whole","date_system":"1900"}

{"sheet":"Sheet1","index":0,"n_rows":555,"n_cols":8,"rows_kept":555,"merged":[[0,0,0,7]]}
["CSSCI（2017-2018）收录来源期刊目录（共 553 种,按刊名音序分学科排序） "]
["序号","学科序号","期刊名称","主办（管）单位","ISSN","CN号","学科","备注"]
[1,"21-1","当代世界社会主义问题","山东大学当代社会主义研究所",{"$f":"VLOOKUP(C3,'[1]CSSCI（2014-2015）来源期刊目录'!$B$2:$F$534,5,0)","v":"1001-5574"},"37-1065/D","马克思主义理论（21种）","《理论视野》删除"]
[2,"21-2","当代世界与社会主义","中共中央编译局",{"$f":"VLOOKUP(C4,'[1]CSSCI（2014-2015）来源期刊目录'!$B$2:$F$534,5,0)","v":"1005-6505"},"11-3404/D","马克思主义理论（21种）"]
[3,"21-3","党的文献","中共中央文献研究室、中央档案馆","1005-1597","11-1359/D","马克思主义理论（21种）","新增"]
[4,"21-4","党建","中共中央宣传部","1002-9702","11-1612/D","马克思主义理论（21种）","新增"]
[5,"21-5","党史研究与教学","中共福建省委党校、福建省中共党史学会",{"$f":"VLOOKUP(C7,'[1]CSSCI（2014-2015）来源期刊目录'!$B$2:$F$534,5,0)","v":"1003-708X"},"35-1059/A","马克思主义理论（21种）"]
[6,"21-6","国外理论动态","中共中央编译局",{"$f":"VLOOKUP(C8,'[1]CSSCI（2014-2015）来源期刊目录'!$B$2:$F$534,5,0)","v":"1674-1277"},"11-4507/D","马克思主义理论（21种）"]
[7,"21-7","红旗文稿","求是杂志社",{"$f":"VLOOKUP(C9,'[1]CSSCI（2014-2015）来源期刊目录'!$B$2:$F$534,5,0)","v":"2095-1817"},"11-4904/D","马克思主义理论（21种）"]
[8,"21-8","教学与研究","中国人民大学11-1454/G4",{"$f":"VLOOKUP(C10,'[1]CSSCI（2014-2015）来源期刊目录'!$B$2:$F$534,5,0)","v":"0257-2826"},"11-1454/G4","马克思主义理论（21种）"]
[9,"21-9","科学社会主义","中国科学社会主义学会",{"$f":"VLOOKUP(C11,'[1]CSSCI（2014-2015）来源期刊目录'!$B$2:$F$534,5,0)","v":"1002-1493"},"11-2797/D","马克思主义理论（21种）"]
[10,"21-10","马克思主义理论学科研究","高等教育出版社","2096-1138","10-1351/A","马克思主义理论（21种）","新增"]
[11,"21-11","马克思主义研究","马克思主义研究院马克思主义研究学部",{"$f":"VLOOKUP(C13,'[1]CSSCI（2014-2015）来源期刊目录'!$B$2:$F$534,5,0)","v":"1006-5199"},"11-3591/A","马克思主义理论（21种）"]
[12,"21-12","马克思主义与现实","中共中央编译局",{"$f":"VLOOKUP(C14,'[1]CSSCI（2014-2015）来源期刊目录'!$B$2:$F$534,5,0)","v":"1004-5961"},"11-3040/A","马克思主义理论（21种）"]
[13,"21-13","毛泽东邓小平理论研究","上海社会科学院等",{"$f":"VLOOKUP(C15,'[1]CSSCI（2014-2015）来源期刊目录'!$B$2:$F$534,5,0)","v":"1005-8273"},"31-1672/A","马克思主义理论（21种）"]
[14,"21-14","南京政治学院学报","解放军南京政治学院","1001-9774","32-1002/D","马克思主义理论（21种）","新增"]
[15,"21-15","求是","中国共产党中央委员会",{"$f":"VLOOKUP(C17,'[1]CSSCI（2014-2015）来源期刊目录'!$B$2:$F$534,5,0)","v":"1002-4980"},"11-1000/D","马克思主义理论（21种）"]
[16,"21-16","社会主义研究","华中师范大学",{"$f":"VLOOKUP(C18,'[1]CSSCI（2014-2015）来源期刊目录'!$B$2:$F$534,5,0)","v":"1001-4527"},"42-1093/D","马克思主义理论（21种）"]
[17,"21-17","思想教育研究","全国高等学校思想政治教育研究会等","1002-5707","11-2549/D","马克思主义理论（21种）","新增"]
[18,"21-18","思想理论教育","上海市高等学校思想理论教育研究会等","1007-192X","31-1220/G4","马克思主义理论（21种）","新增"]
[19,"21-19","思想理论教育导刊","高等教育出版社",{"$f":"VLOOKUP(C21,'[1]CSSCI（2014-2015）来源期刊目录'!$B$2:$F$534,5,0)","v":"1009-2528"},"11-4062/G4","马克思主义理论（21种）"]
[20,"21-20","中共党史研究","中共党史研究室",{"$f":"VLOOKUP(C22,'[1]CSSCI（2014-2015）来源期刊目录'!$B$2:$F$534,5,0)","v":"1003-3815"},"11-1675/D","马克思主义理论（21种）"]
[21,"21-21","中国特色社会主义研究","北京市社会科学界联合会等",{"$f":"VLOOKUP(C23,'[1]CSSCI（2014-2015）来源期刊目录'!$B$2:$F$534,5,0)","v":"1006-6470"},"11-3527/D","马克思主义理论（21种）"]
[22,"29-1","公共管理学报","哈尔滨工业大学管理学院",{"$f":"VLOOKUP(C24,'[1]CSSCI（2014-2015）来源期刊目录'!$B$2:$F$534,5,0)","v":"1672-6162"},"23-1523/F","管理学（29种）","《科技管理研究》、《中国科学基金》去除"]
[23,"29-2","管理工程学报","浙江大学",{"$f":"VLOOKUP(C25,'[1]CSSCI（2014-2015）来源期刊目录'!$B$2:$F$534,5,0)","v":"1004-6062"},"33-1136/N","管理学（29种）"]
[24,"29-3","管理科学","哈尔滨工业大学管理学院",{"$f":"VLOOKUP(C26,'[1]CSSCI（2014-2015）来源期刊目录'!$B$2:$F$534,5,0)","v":"1672-0334"},"23-1510/C","管理学（29种）"]
[25,"29-4","管理科学学报","国家自然科学基金委员会管理科学部等",{"$f":"VLOOKUP(C27,'[1]CSSCI（2014-2015）来源期刊目录'!$B$2:$F$534,5,0)","v":"1007-9807"},"12-1275/G3","管理学（29种）"]
[26,"29-5","管理评论","中国科学院大学",{"$f":"VLOOKUP(C28,'[1]CSSCI（2014-2015）来源期刊目录'!$B$2:$F$534,5,0)","v":"1003-1952"},"11-5057/F","管理学（29种）"]
[27,"29-6","管理世界","中华人民共和国国务院发展研究中心",{"$f":"VLOOKUP(C29,'[1]CSSCI（2014-2015）来源期刊目录'!$B$2:$F$534,5,0)","v":"1002-5502"},"11-1235/F","管理学（29种）"]
[28,"29-7","管理学报","华中科技大学",{"$f":"VLOOKUP(C30,'[1]CSSCI（2014-2015）来源期刊目录'!$B$2:$F$534,5,0)","v":"1672-884X"},"42-1725/C","管理学（29种）"]
[29,"29-8","华东经济管理","安徽经济管理学院",{"$f":"VLOOKUP(C31,'[1]CSSCI（2014-2015）来源期刊目录'!$B$2:$F$534,5,0)","v":"1007-5097"},"34-1014/F","管理学（29种）"]
[30,"29-9","经济管理","中国社会科学院工业经济研究所",{"$f":"VLOOKUP(C32,'[1]CSSCI（2014-2015）来源期刊目录'!$B$2:$F$534,5,0)","v":"1002-5766"},"11-1047/F","管理学（29种）"]
[31,"29-10","经济体制改革","四川省社会科学院",{"$f":"VLOOKUP(C33,'[1]CSSCI（2014-2015）来源期刊目录'!$B$2:$F$534,5,0)","v":"1006-012X"},"51-1027/F","管理学（29种）"]
[32,"29-11","科技进步与对策","湖北省科技信息研究院",{"$f":"VLOOKUP(C34,'[1]CSSCI（2014-2015）来源期刊目录'!$B$2:$F$534,5,0)","v":"1001-7348"},"42-1224/G3","管理学（29种）"]
[33,"29-12","科学管理研究","内蒙古自治区软科学研究会",{"$f":"VLOOKUP(C35,'[1]CSSCI（2014-2015）来源期刊目录'!$B$2:$F$534,5,0)","v":"1004-115X"},"15-1103/G3","管理学（29种）"]
[34,"29-13","科学决策","中国社会经济系统分析研究会等","1006-4885","11-3472/G3","管理学（29种）","新增"]
[35,"29-14","科学学研究","中国科学学与科技政策研究会",{"$f":"VLOOKUP(C37,'[1]CSSCI（2014-2015）来源期刊目录'!$B$2:$F$534,5,0)","v":"1003-2053"},"11-1805/G3","管理学（29种）"]
[36,"29-15","科学学与科学技术管理","中国科学学与科技政策研究会等",{"$f":"VLOOKUP(C38,'[1]CSSCI（2014-2015）来源期刊目录'!$B$2:$F$534,5,0)","v":"1002-0241"},"12-1117/G3","管理学（29种）"]
[37,"29-16","科研管理","中国科学院科技政策与管理科学研究所等",{"$f":"VLOOKUP(C39,'[1]CSSCI（2014-2015）来源期刊目录'!$B$2:$F$534,5,0)","v":"1000-2995"},"11-1567/G3","管理学（29种）"]
[38,"29-17","南开管理评论","南开大学商学院",{"$f":"VLOOKUP(C40,'[1]CSSCI（2014-2015）来源期刊目录'!$B$2:$F$534,5,0)","v":"1008-3448"},"12-1288/F","管理学（29种）"]
[39,"29-18","软科学","四川省科技促进发展研究中心",{"$f":"VLOOKUP(C41,'[1]CSSCI（2014-2015）来源期刊目录'!$B$2:$F$534,5,0)","v":"1001—8409"},"51-1268/G3","管理学（29种）"]
[40,"29-19","社会保障评论","中国社会保障学会","2096-3211","10-1472/C","管理学（29种）","新增"]
[41,"29-20","外国经济与管理","上海财经大学",{"$f":"VLOOKUP(C43,'[1]CSSCI（2014-2015）来源期刊目录'!$B$2:$F$534,5,0)","v":"1001-4950"},"31-1063/F","管理学（29种）"]
[42,"29-21","系统工程","湖南省系统工程与管理学会",{"$f":"VLOOKUP(C44,'[1]CSSCI（2014-2015）来源期刊目录'!$B$2:$F$534,5,0)","v":"1001-4098"},"43-1115/N","管理学（29种）"]
[43,"29-22","系统工程理论与实践","中国系统工程学会",{"$f":"VLOOKUP(C45,'[1]CSSCI（2014-2015）来源期刊目录'!$B$2:$F$534,5,0)","v":"1000-6788"},"11-2267/N","管理学（29种）"]
[44,"29-23","系统管理学报","上海交通大学",{"$f":"VLOOKUP(C46,'[1]CSSCI（2014-2015）来源期刊目录'!$B$2:$F$534,5,0)","v":"1005-2542"},"31-1977/N","管理学（29种）"]
[45,"29-24","研究与发展管理","复旦大学",{"$f":"VLOOKUP(C47,'[1]CSSCI（2014-2015）来源期刊目录'!$B$2:$F$534,5,0)","v":"1004-8308"},"31-1599/G3","管理学（29种）"]
[46,"29-25","预测","合肥工业大学预测与发展研究所",{"$f":"VLOOKUP(C48,'[1]CSSCI（2014-2015）来源期刊目录'!$B$2:$F$534,5,0)","v":"1003-5192"},"34-1013/N","管理学（29种）"]
[47,"29-26","中国管理科学","中国科学院科技政策与管理科学研究所等",{"$f":"VLOOKUP(C49,'[1]CSSCI（2014-2015）来源期刊目录'!$B$2:$F$534,5,0)","v":"1003-207X"},"11-2835/G3","管理学（29种）"]
[48,"29-27","中国行政管理","中国行政管理学会",{"$f":"VLOOKUP(C50,'[1]CSSCI（2014-2015）来源期刊目录'!$B$2:$F$534,5,0)","v":"1006-0863"},"11-1145/D","管理学（29种）"]
[49,"29-28","中国科技论坛","中国科学技术发展战略研究院",{"$f":"VLOOKUP(C51,'[1]CSSCI（2014-2015）来源期刊目录'!$B$2:$F$534,5,0)","v":"1002-6711"},"11-1344/G3","管理学（29种）"]
[50,"29-29","中国软科学","中国软科学研究会",{"$f":"VLOOKUP(C52,'[1]CSSCI（2014-2015）来源期刊目录'!$B$2:$F$534,5,0)","v":"1002-9753"},"11-3036/G3","管理学（29种）"]
[51,"13-1","道德与文明","中国伦理学会、天津社会科学院",{"$f":"VLOOKUP(C53,'[1]CSSCI（2014-2015）来源期刊目录'!$B$2:$F$534,5,0)","v":"1007-1539"},"12-1029/B","哲学（13种）"]
[52,"13-2","科学技术哲学研究","山西大学、山西省自然辩证法研究会",{"$f":"VLOOKUP(C54,'[1]CSSCI（2014-2015）来源期刊目录'!$B$2:$F$534,5,0)","v":"1674-7062"},"14-1354/G3","哲学（13种）"]
[53,"13-3","孔子研究","中国孔子基金会",{"$f":"VLOOKUP(C55,'[1]CSSCI（2014-2015）来源期刊目录'!$B$2:$F$534,5,0)","v":"1002-2627"},"37-1037/C","哲学（13种）"]
[54,"13-4","伦理学研究","湖南师范大学伦理学研究所",{"$f":"VLOOKUP(C56,'[1]CSSCI（2014-2015）来源期刊目录'!$B$2:$F$534,5,0)","v":"1671-9115"},"43-1385/C","哲学（13种）"]
[55,"13-5","逻辑学研究","中山大学","1674-3202","44-1649/C","哲学（13种）","新增"]
[56,"13-6","世界哲学","中国社会科学院哲学研究所",{"$f":"VLOOKUP(C58,'[1]CSSCI（2014-2015）来源期刊目录'!$B$2:$F$534,5,0)","v":"1671-4318"},"11-4748/B","哲学（13种）"]
[57,"13-7","现代哲学","广东哲学学会",{"$f":"VLOOKUP(C59,'[1]CSSCI（2014-2015）来源期刊目录'!$B$2:$F$534,5,0)","v":"1000-7660"},"44-1071/B","哲学（13种）"]
[58,"13-8","哲学动态","中国社会科学院哲学研究所",{"$f":"VLOOKUP(C60,'[1]CSSCI（2014-2015）来源期刊目录'!$B$2:$F$534,5,0)","v":"1002-8862"},"11-1141/B","哲学（13种）"]
[59,"13-9","哲学研究","中国社会科学院哲学研究所",{"$f":"VLOOKUP(C61,'[1]CSSCI（2014-2015）来源期刊目录'!$B$2:$F$534,5,0)","v":"1000-0216"},"11-1140/B","哲学（13种）"]
[60,"13-10","中国哲学史","中国哲学史学会",{"$f":"VLOOKUP(C62,'[1]CSSCI（2014-2015）来源期刊目录'!$B$2:$F$534,5,0)","v":"1005-0396"},"11-3042/B","哲学（13种）"]
[61,"13-11","周易研究","山东大学、中国周易学会",{"$f":"VLOOKUP(C63,'[1]CSSCI（2014-2015）来源期刊目录'!$B$2:$F$534,5,0)","v":"1003-3882"},"37-1191/C","哲学（13种）"]
[62,"13-12","自然辩证法通讯","中国科学院大学",{"$f":"VLOOKUP(C64,'[1]CSSCI（2014-2015）来源期刊目录'!$B$2:$F$534,5,0)","v":"1000-0763"},"11-1518/N","哲学（13种）"]
[63,"13-13","自然辩证法研究","中国自然辩证法研究会",{"$f":"VLOOKUP(C65,'[1]CSSCI（2014-2015）来源期刊目录'!$B$2:$F$534,5,0)","v":"1000-8934"},"11-1649/B","哲学（13种）"]
[64,"3-1","世界宗教文化","中国社会科学院世界宗教研究所",{"$f":"VLOOKUP(C66,'[1]CSSCI（2014-2015）来源期刊目录'!$B$2:$F$534,5,0)","v":"1007-6255"},"11-3631/B","宗教学（3种）"]
[65,"3-2","世界宗教研究","中国社会科学院世界宗教研究所",{"$f":"VLOOKUP(C67,'[1]CSSCI（2014-2015）来源期刊目录'!$B$2:$F$534,5,0)","v":"1000-4289"},"11-1299/B","宗教学（3种）"]
[66,"3-3","宗教学研究","四川大学道教与宗教文化研究所",{"$f":"VLOOKUP(C68,'[1]CSSCI（2014-2015）来源期刊目录'!$B$2:$F$534,5,0)","v":"1006-1312"},"51-1069/B","宗教学（3种）"]
[67,"24-1","当代修辞学","复旦大学",{"$f":"VLOOKUP(C69,'[1]CSSCI（2014-2015）来源期刊目录'!$B$2:$F$534,5,0)","v":"1674-8026"},"31-2043/H","语言学（24种）","《外语学刊》去除"]
[68,"24-2","当代语言学","中国社会科学院语言研究所",{"$f":"VLOOKUP(C70,'[1]CSSCI（2014-2015）来源期刊目录'!$B$2:$F$534,5,0)","v":"1007-8274"},"11-3879/H","语言学（24种）"]
[69,"24-3","方言","中国社会科学院语言研究所",{"$f":"VLOOKUP(C71,'[1]CSSCI（2014-2015）来源期刊目录'!$B$2:$F$534,5,0)","v":"0257-0203"},"11-1052/H","语言学（24种）"]
[70,"24-4","古汉语研究","湖南师范大学","1001-5442","43-1145/H","语言学（24种）","新增"]
[71,"24-5","汉语学报","华中师范大学",{"$f":"VLOOKUP(C73,'[1]CSSCI（2014-2015）来源期刊目录'!$B$2:$F$534,5,0)","v":"1672-9501"},"42-1729/H","语言学（24种）"]
[72,"24-6","民族语文","中国社会科学院民族学与人类学研究所",{"$f":"VLOOKUP(C74,'[1]CSSCI（2014-2015）来源期刊目录'!$B$2:$F$534,5,0)","v":"0257-5779"},"11-1216/H","语言学（24种）"]
[73,"24-7","世界汉语教学","北京语言大学",{"$f":"VLOOKUP(C75,'[1]CSSCI（2014-2015）来源期刊目录'!$B$2:$F$534,5,0)","v":"1002-5804"},"11-1473/H","语言学（24种）"]
[74,"24-8","外国语","上海外国语大学",{"$f":"VLOOKUP(C76,'[1]CSSCI（2014-2015）来源期刊目录'!$B$2:$F$534,5,0)","v":"1004-5139"},"31-1038/H","语言学（24种）"]
[75,"24-9","外语电化教学","上海外国语大学",{"$f":"VLOOKUP(C77,'[1]CSSCI（2014-2015）来源期刊目录'!$B$2:$F$534,5,0)","v":"1001-5795"},"31-1036/G4","语言学（24种）"]
[76,"24-10","外语教学","西安外国语大学",{"$f":"VLOOKUP(C78,'[1]CSSCI（2014-2015）来源期刊目录'!$B$2:$F$534,5,0)","v":"1000-5544"},"61-1023/H","语言学（24种）"]
[77,"24-11","外语教学理论与实践","华东师范大学外语学院",{"$f":"VLOOKUP(C79,'[1]CSSCI（2014-2015）来源期刊目录'!$B$2:$F$534,5,0)","v":"1674-1234"},"31-1964/H","语言学（24种）"]
[78,"24-12","外语教学与研究","北京外国语大学",{"$f":"VLOOKUP(C80,'[1]CSSCI（2014-2015）来源期刊目录'!$B$2:$F$534,5,0)","v":"1000-0429"},"11-1251/G4","语言学（24种）"]
[79,"24-13","外语界","上海外国语大学",{"$f":"VLOOKUP(C81,'[1]CSSCI（2014-2015）来源期刊目录'!$B$2:$F$534,5,0)","v":"1004-5112"},"31-1040/H","语言学（24种）"]
[80,"24-14","外语研究","中国人民解放军国际关系学院","1005-7242","32-1001/H","语言学（24种）","新增"]
[81,"24-15","外语与外语教学","大连外国语大学",{"$f":"VLOOKUP(C83,'[1]CSSCI（2014-2015）来源期刊目录'!$B$2:$F$534,5,0)","v":"1004-6038"},"21-1060/H","语言学（24种）"]
[82,"24-16","现代外语","广东外语外贸大学",{"$f":"VLOOKUP(C84,'[1]CSSCI（2014-2015）来源期刊目录'!$B$2:$F$534,5,0)","v":"1003-6105"},"44-1165/H","语言学（24种）"]
[83,"24-17","语文研究","山西省社会科学院",{"$f":"VLOOKUP(C85,'[1]CSSCI（2014-2015）来源期刊目录'!$B$2:$F$534,5,0)","v":"1000-2979"},"14-1059/H","语言学（24种）"]
[84,"24-18","语言教学与研究","北京语言大学",{"$f":"VLOOKUP(C86,'[1]CSSCI（2014-2015）来源期刊目录'!$B$2:$F$534,5,0)","v":"0257-9448"},"11-1472/H","语言学（24种）"]
[85,"24-19","语言科学","江苏师范大学语言研究所",{"$f":"VLOOKUP(C87,'[1]CSSCI（2014-2015）来源期刊目录'!$B$2:$F$534,5,0)","v":"1671-9484"},"32-1687/G","语言学（24种）"]
[86,"24-20","语言文字应用","教育部语言文字应用研究所",{"$f":"VLOOKUP(C88,'[1]CSSCI（2014-2015）来源期刊目录'!$B$2:$F$534,5,0)","v":"1003-5397"},"11-2888/H","语言学（24种）"]
[87,"24-21","语言研究","华中科技大学中国语言研究所",{"$f":"VLOOKUP(C89,'[1]CSSCI（2014-2015）来源期刊目录'!$B$2:$F$534,5,0)","v":"1000-1263"},"42-1025/H","语言学（24种）"]
[88,"24-22","中国翻译","中国外文局对外传播研究中心等",{"$f":"VLOOKUP(C90,'[1]CSSCI（2014-2015）来源期刊目录'!$B$2:$F$534,5,0)","v":"1000-873X"},"11-1354/H","语言学（24种）"]
[89,"24-23","中国外语","高等教育出版社",{"$f":"VLOOKUP(C91,'[1]CSSCI（2014-2015）来源期刊目录'!$B$2:$F$534,5,0)","v":"1672-9382"},"11-5280/H","语言学（24种）"]
[90,"24-24","中国语文","中国社会科学院语言研究所",{"$f":"VLOOKUP(C92,'[1]CSSCI（2014-2015）来源期刊目录'!$B$2:$F$534,5,0)","v":"0578-1949"},"11-1053/H","语言学（24种）"]
[91,"6-1","当代外国文学","南京大学外国文学研究所",{"$f":"VLOOKUP(C93,'[1]CSSCI（2014-2015）来源期刊目录'!$B$2:$F$534,5,0)","v":"1001-1757"},"32-1087/I","外国文学（6种）"]
[92,"6-2","俄罗斯文艺","北京师范大学",{"$f":"VLOOKUP(C94,'[1]CSSCI（2014-2015）来源期刊目录'!$B$2:$F$534,5,0)","v":"1005-7684"},"11-5702/I","外国文学（6种）"]
[93,"6-3","国外文学","北京大学",{"$f":"VLOOKUP(C95,'[1]CSSCI（2014-2015）来源期刊目录'!$B$2:$F$534,5,0)","v":"1002-5014"},"11-1562/I","外国文学（6种）"]
[94,"6-4","外国文学","北京外国语大学",{"$f":"VLOOKUP(C96,'[1]CSSCI（2014-2015）来源期刊目录'!$B$2:$F$534,5,0)","v":"1002-5529"},"11-1248/I","外国文学（6种）"]
[95,"6-5","外国文学评论","中国社会科学院外国文学研究所",{"$f":"VLOOKUP(C97,'[1]CSSCI（2014-2015）来源期刊目录'!$B$2:$F$534,5,0)","v":"1001-6368"},"11-1068/I","外国文学（6种）"]
[96,"6-6","外国文学研究","华中师范大学文学院",{"$f":"VLOOKUP(C98,'[1]CSSCI（2014-2015）来源期刊目录'!$B$2:$F$534,5,0)","v":"1003-7519"},"42-1060/I","外国文学（6种）"]
[97,"16-1","当代作家评论","辽宁省作家协会",{"$f":"VLOOKUP(C99,'[1]CSSCI（2014-2015）来源期刊目录'!$B$2:$F$534,5,0)","v":"1002-1809"},"21-1046/I","中国文学（16种）","《当代文坛》《红楼梦学刊》"]
[98,"16-2","鲁迅研究月刊","北京鲁迅博物馆",{"$f":"VLOOKUP(C100,'[1]CSSCI（2014-2015）来源期刊目录'!$B$2:$F$534,5,0)","v":"1003-0638"},"11-2722/I","中国文学（16种）"]
[99,"16-3","民族文学研究","中国社会科学院民族文学研究所",{"$f":"VLOOKUP(C101,'[1]CSSCI（2014-2015）来源期刊目录'!$B$2:$F$534,5,0)","v":"1002-9559"},"11-1443/I","中国文学（16种）"]
[100,"16-4","明清小说研究","江苏省社会科学院文学研究所等","1004-3330","32-1017/I","中国文学（16种）","新增"]
[101,"16-5","南方文坛","广西文联",{"$f":"VLOOKUP(C103,'[1]CSSCI（2014-2015）来源期刊目录'!$B$2:$F$534,5,0)","v":"1003-7772"},"45-1049/I","中国文学（16种）"]
[102,"16-6","文学评论","中国社会科学院文学研究所",{"$f":"VLOOKUP(C104,'[1]CSSCI（2014-2015）来源期刊目录'!$B$2:$F$534,5,0)","v":"0511-4683"},"11-1037","中国文学（16种）"]
[103,"16-7","文学遗产","中国社会科学院文学研究所",{"$f":"VLOOKUP(C105,'[1]CSSCI（2014-2015）来源期刊目录'!$B$2:$F$534,5,0)","v":"0257-5914"},"11-1009/I","中国文学（16种）"]
[104,"16-8","文艺理论研究","中国文艺理论学会、华东师范大学",{"$f":"VLOOKUP(C106,'[1]CSSCI（2014-2015）来源期刊目录'!$B$2:$F$534,5,0)","v":"0257-0254"},"31-1152/I","中国文学（16种）"]
[105,"16-9","文艺理论与批评","中国艺术研究院",{"$f":"VLOOKUP(C107,'[1]CSSCI（2014-2015）来源期刊目录'!$B$2:$F$534,5,0)","v":"1002-9583"},"11-1581/J","中国文学（16种）"]
[106,"16-10","文艺争鸣","吉林省文学艺术界联合会",{"$f":"VLOOKUP(C108,'[1]CSSCI（2014-2015）来源期刊目录'!$B$2:$F$534,5,0)","v":"1003-9538"},"22-1031/I","中国文学（16种）"]
[107,"16-11","小说评论","陕西省作家协会",{"$f":"VLOOKUP(C109,'[1]CSSCI（2014-2015）来源期刊目录'!$B$2:$F$534,5,0)","v":"1004-2164"},"61-1017/J","中国文学（16种）"]
[108,"16-12","新文学史料","人民文学出版社",{"$f":"VLOOKUP(C110,'[1]CSSCI（2014-2015）来源期刊目录'!$B$2:$F$534,5,0)","v":"0257-5647"},"11-1283/I","中国文学（16种）"]
[109,"16-13","扬子江评论","江苏省作家协会",{"$f":"VLOOKUP(C111,'[1]CSSCI（2014-2015）来源期刊目录'!$B$2:$F$534,5,0)","v":"1009-542X"},"32-1787/I","中国文学（16种）","另外一本《扬子江诗刊》同CN号，但是属于文学创作，不收录"]
[110,"16-14","中国比较文学","上海外国语大学、中国比较文学学会",{"$f":"VLOOKUP(C112,'[1]CSSCI（2014-2015）来源期刊目录'!$B$2:$F$534,5,0)","v":"1006-6101"},"31-1694/I","中国文学（16种）"]
[111,"16-15","中国文学研究","湖南师范大学","1003-7535","43-1084/I","中国文学（16种）","新增"]
[112,"16-16","中国现代文学研究丛刊","中国现代文学馆",{"$f":"VLOOKUP(C114,'[1]CSSCI（2014-2015）来源期刊目录'!$B$2:$F$534,5,0)","v":"1003-0263"},"11-2589/I","中国文学（16种）"]
[113,"22-1","北京电影学院学报","北京电影学院","1002-6142","11-1677/J","艺术学（22种）","新增"]
[114,"22-2","北京舞蹈学院学报","北京舞蹈学院",{"$f":"VLOOKUP(C116,'[1]CSSCI（2014-2015）来源期刊目录'!$B$2:$F$534,5,0)","v":"1008-2018"},"11-3982/J","艺术学（22种）","《美术观察》《戏剧》《装饰》去除"]
[115,"22-3","当代电影","中国电影艺术研究中心等",{"$f":"VLOOKUP(C117,'[1]CSSCI（2014-2015）来源期刊目录'!$B$2:$F$534,5,0)","v":"1002-4646"},"11-1447/G2","艺术学（22种）"]
[116,"22-4","电影艺术","中国电影家协会",{"$f":"VLOOKUP(C118,'[1]CSSCI（2014-2015）来源期刊目录'!$B$2:$F$534,5,0)","v":"0257-0181"},"11-1528/J","艺术学（22种）"]
[117,"22-5","建筑学报","中国建筑学会","0529-1399","11-1930/TU","艺术学（22种）","新增"]
[118,"22-6","美术","中国美术家协会","1003-1774","11-1311/J","艺术学（22种）","新增"]
{"$rows_left_out":436}
{"sheet":"Sheet2","index":1,"n_rows":554,"n_cols":3,"rows_kept":554}
["期刊名称","主办单位","ISSN"]
["当代世界社会主义问题","山东大学当代社会主义研究所","1001-5574"]
["当代世界与社会主义","中共中央编译局","1005-6505"]
["党的文献","中共中央文献研究室、中央档案馆","1005-1597"]
["党建","中共中央宣传部","1002-9702"]
["党史研究与教学","中共福建省委党校、福建省中共党史学会","1003-708X"]
["国外理论动态","中共中央编译局","1674-1277"]
["红旗文稿","求是杂志社","2095-1817"]
["教学与研究","中国人民大学11-1454/G4","0257-2826"]
["科学社会主义","中国科学社会主义学会","1002-1493"]
["马克思主义理论学科研究","高等教育出版社","2096-1138"]
["马克思主义研究","马克思主义研究院马克思主义研究学部","1006-5199"]
["马克思主义与现实","中共中央编译局","1004-5961"]
["毛泽东邓小平理论研究","上海社会科学院等","1005-8273"]
["南京政治学院学报","解放军南京政治学院","1001-9774"]
["求是","中国共产党中央委员会","1002-4980"]
["社会主义研究","华中师范大学","1001-4527"]
["思想教育研究","全国高等学校思想政治教育研究会等","1002-5707"]
["思想理论教育","上海市高等学校思想理论教育研究会等","1007-192X"]
["思想理论教育导刊","高等教育出版社","1009-2528"]
["中共党史研究","中共党史研究室","1003-3815"]
["中国特色社会主义研究","北京市社会科学界联合会等","1006-6470"]
["公共管理学报","哈尔滨工业大学管理学院","1672-6162"]
["管理工程学报","浙江大学","1004-6062"]
["管理科学","哈尔滨工业大学管理学院","1672-0334"]
["管理科学学报","国家自然科学基金委员会管理科学部等","1007-9807"]
["管理评论","中国科学院大学","1003-1952"]
["管理世界","中华人民共和国国务院发展研究中心","1002-5502"]
["管理学报","华中科技大学","1672-884X"]
["华东经济管理","安徽经济管理学院","1007-5097"]
["经济管理","中国社会科学院工业经济研究所","1002-5766"]
["经济体制改革","四川省社会科学院","1006-012X"]
["科技进步与对策","湖北省科技信息研究院","1001-7348"]
["科学管理研究","内蒙古自治区软科学研究会","1004-115X"]
["科学决策","中国社会经济系统分析研究会等","1006-4885"]
["科学学研究","中国科学学与科技政策研究会","1003-2053"]
["科学学与科学技术管理","中国科学学与科技政策研究会等","1002-0241"]
["科研管理","中国科学院科技政策与管理科学研究所等","1000-2995"]
["南开管理评论","南开大学商学院","1008-3448"]
["软科学","四川省科技促进发展研究中心","1001—8409"]
["社会保障评论","中国社会保障学会","2096-3211"]
["外国经济与管理","上海财经大学","1001-4950"]
["系统工程","湖南省系统工程与管理学会","1001-4098"]
["系统工程理论与实践","中国系统工程学会","1000-6788"]
["系统管理学报","上海交通大学","1005-2542"]
["研究与发展管理","复旦大学","1004-8308"]
["预测","合肥工业大学预测与发展研究所","1003-5192"]
["中国管理科学","中国科学院科技政策与管理科学研究所等","1003-207X"]
["中国行政管理","中国行政管理学会","1006-0863"]
["中国科技论坛","中国科学技术发展战略研究院","1002-6711"]
["中国软科学","中国软科学研究会","1002-9753"]
["道德与文明","中国伦理学会、天津社会科学院","1007-1539"]
["科学技术哲学研究","山西大学、山西省自然辩证法研究会","1674-7062"]
["孔子研究","中国孔子基金会","1002-2627"]
["伦理学研究","湖南师范大学伦理学研究所","1671-9115"]
["逻辑学研究","中山大学","1674-3202"]
["世界哲学","中国社会科学院哲学研究所","1671-4318"]
["现代哲学","广东哲学学会","1000-7660"]
["哲学动态","中国社会科学院哲学研究所","1002-8862"]
["哲学研究","中国社会科学院哲学研究所","1000-0216"]
["中国哲学史","中国哲学史学会","1005-0396"]
["周易研究","山东大学、中国周易学会","1003-3882"]
["自然辩证法通讯","中国科学院大学","1000-0763"]
["自然辩证法研究","中国自然辩证法研究会","1000-8934"]
["世界宗教文化","中国社会科学院世界宗教研究所","1007-6255"]
["世界宗教研究","中国社会科学院世界宗教研究所","1000-4289"]
["宗教学研究","四川大学道教与宗教文化研究所","1006-1312"]
["当代修辞学","复旦大学","1674-8026"]
["当代语言学","中国社会科学院语言研究所","1007-8274"]
["方言","中国社会科学院语言研究所","0257-0203"]
["古汉语研究","湖南师范大学","1001-5442"]
["汉语学报","华中师范大学","1672-9501"]
["民族语文","中国社会科学院民族学与人类学研究所","0257-5779"]
["世界汉语教学","北京语言大学","1002-5804"]
["外国语","上海外国语大学","1004-5139"]
["外语电化教学","上海外国语大学","1001-5795"]
["外语教学","西安外国语大学","1000-5544"]
["外语教学理论与实践","华东师范大学外语学院","1674-1234"]
["外语教学与研究","北京外国语大学","1000-0429"]
["外语界","上海外国语大学","1004-5112"]
["外语研究","中国人民解放军国际关系学院","1005-7242"]
["外语与外语教学","大连外国语大学","1004-6038"]
["现代外语","广东外语外贸大学","1003-6105"]
["语文研究","山西省社会科学院","1000-2979"]
["语言教学与研究","北京语言大学","0257-9448"]
["语言科学","江苏师范大学语言研究所","1671-9484"]
["语言文字应用","教育部语言文字应用研究所","1003-5397"]
["语言研究","华中科技大学中国语言研究所","1000-1263"]
["中国翻译","中国外文局对外传播研究中心等","1000-873X"]
["中国外语","高等教育出版社","1672-9382"]
["中国语文","中国社会科学院语言研究所","0578-1949"]
["当代外国文学","南京大学外国文学研究所","1001-1757"]
["俄罗斯文艺","北京师范大学","1005-7684"]
["国外文学","北京大学","1002-5014"]
["外国文学","北京外国语大学","1002-5529"]
["外国文学评论","中国社会科学院外国文学研究所","1001-6368"]
["外国文学研究","华中师范大学文学院","1003-7519"]
["当代作家评论","辽宁省作家协会","1002-1809"]
["鲁迅研究月刊","北京鲁迅博物馆","1003-0638"]
["民族文学研究","中国社会科学院民族文学研究所","1002-9559"]
["明清小说研究","江苏省社会科学院文学研究所等","1004-3330"]
["南方文坛","广西文联","1003-7772"]
["文学评论","中国社会科学院文学研究所","0511-4683"]
["文学遗产","中国社会科学院文学研究所","0257-5914"]
["文艺理论研究","中国文艺理论学会、华东师范大学","0257-0254"]
["文艺理论与批评","中国艺术研究院","1002-9583"]
["文艺争鸣","吉林省文学艺术界联合会","1003-9538"]
["小说评论","陕西省作家协会","1004-2164"]
["新文学史料","人民文学出版社","0257-5647"]
["扬子江评论","江苏省作家协会","1009-542X"]
["中国比较文学","上海外国语大学、中国比较文学学会","1006-6101"]
["中国文学研究","湖南师范大学","1003-7535"]
["中国现代文学研究丛刊","中国现代文学馆","1003-0263"]
["北京电影学院学报","北京电影学院","1002-6142"]
["北京舞蹈学院学报","北京舞蹈学院","1008-2018"]
["当代电影","中国电影艺术研究中心等","1002-4646"]
["电影艺术","中国电影家协会","0257-0181"]
["建筑学报","中国建筑学会","0529-1399"]
["美术","中国美术家协会","1003-1774"]
["美术研究","中央美术学院","0461-6855"]
{"$rows_left_out":434}